Reaction Details
TargetTyrosine-protein phosphatase non-receptor type 22
LigandBDBM74516
Substrate/Competitorn/a
Meas. Tech.Dose Response confirmation of uHTS hits from a small molecule inhibitors of LYP via a fluorescence intensity assay using pCAP substrate
IC50 64741±n/a nM
Citation PubChem, PC Dose Response confirmation of uHTS hits from a small molecule inhibitors of LYP via a fluorescence intensity assay using pCAP substrate PubChem Bioassay(2010)[AID]
 
Tyrosine-protein phosphatase non-receptor type 22
Name:Tyrosine-protein phosphatase non-receptor type 22
Type:n/a
Mol. Mass.:91712.31
Organism:Homo sapiens (Human)
Description:Q9Y2R2
Residue:807
BDBM74516
NameBDBM74516
Synonyms:4-hydroxy-N-[[4-[2-(3-nitroanilino)-2-oxoethoxy]phenyl]methylideneamino]benzamide MLS000714465 SMR000274444 | cid_1083695
TypeSmall organic molecule
Emp. Form.C22H18N4O6
Mol. Mass.434.4015
SMILESOc1ccc(cc1)C(=O)NN=Cc1ccc(OCC(=O)Nc2cccc(c2)[N+]([O-])=O)cc1