Reaction Details
TargetTyrosine-protein phosphatase non-receptor type 22
LigandBDBM75324
Substrate/Competitorn/a
Meas. Tech.SAR LYP1 Fluorescent Assay using OMFP substrate for In Vitro dose response studies - Set 3
IC50 821±n/a nM
Citation PubChem, PC SAR LYP1 Fluorescent Assay using OMFP substrate for In Vitro dose response studies - Set 3 PubChem Bioassay(2010)[AID]
 
Tyrosine-protein phosphatase non-receptor type 22
Name:Tyrosine-protein phosphatase non-receptor type 22
Type:n/a
Mol. Mass.:91712.31
Organism:Homo sapiens (Human)
Description:Q9Y2R2
Residue:807
BDBM75324
NameBDBM75324
Synonyms:4-[5-[(Z)-[3-(4-nitrophenyl)-4-oxidanylidene-2-sulfanylidene-1,3-thiazolidin-5-ylidene]methyl]furan-2-yl]benzoic acid 4-[5-[(Z)-[3-(4-nitrophenyl)-4-oxo-2-sulfanylidene-5-thiazolidinylidene]methyl]-2-furanyl]benzoic acid MLS-0146245.0001 | cid_5341808
TypeSmall organic molecule
Emp. Form.C21H12N2O6S2
Mol. Mass.452.46
SMILESOC(=O)c1ccc(cc1)-c1ccc(\C=C2/SC(=S)N(C2=O)c2ccc(cc2)[N+]([O-])=O)o1