Reaction Details
TargetTyrosine-protein phosphatase non-receptor type 22
LigandBDBM46212
Substrate/Competitorn/a
Meas. Tech.SAR LYP1 Fluorescent Assay using OMFP substrate for In Vitro dose response studies - Set 3
IC50 1510±n/a nM
Citation PubChem, PC SAR LYP1 Fluorescent Assay using OMFP substrate for In Vitro dose response studies - Set 3 PubChem Bioassay(2010)[AID]
 
Tyrosine-protein phosphatase non-receptor type 22
Name:Tyrosine-protein phosphatase non-receptor type 22
Type:n/a
Mol. Mass.:91712.31
Organism:Homo sapiens (Human)
Description:Q9Y2R2
Residue:807
BDBM46212
NameBDBM46212
Synonyms:2-[2-chloranyl-6-methoxy-4-[(Z)-[3-[2-[(4-methylphenyl)amino]-2-oxidanylidene-ethyl]-2,4-bis(oxidanylidene)-1,3-thiazolidin-5-ylidene]methyl]phenoxy]ethanoic acid 2-[2-chloro-6-methoxy-4-[(Z)-[3-[2-(4-methylanilino)-2-oxoethyl]-2,4-dioxo-1,3-thiazolidin-5-ylidene]methyl]phenoxy]acetic acid MLS-0350105.0001 | cid_9512029
TypeSmall organic molecule
Emp. Form.C22H19ClN2O7S
Mol. Mass.490.913
SMILESCOc1cc(\C=C2/SC(=O)N(CC(=O)Nc3ccc(C)cc3)C2=O)cc(Cl)c1OCC(O)=O