Reaction Details
TargetTyrosine-protein phosphatase non-receptor type 22
LigandBDBM46215
Substrate/Competitorn/a
Meas. Tech.SAR LYP1 Fluorescent Assay using OMFP substrate for In Vitro dose response studies - Set 3
IC50 4010±n/a nM
Citation PubChem, PC SAR LYP1 Fluorescent Assay using OMFP substrate for In Vitro dose response studies - Set 3 PubChem Bioassay(2010)[AID]
 
Tyrosine-protein phosphatase non-receptor type 22
Name:Tyrosine-protein phosphatase non-receptor type 22
Type:n/a
Mol. Mass.:91712.31
Organism:Homo sapiens (Human)
Description:Q9Y2R2
Residue:807
BDBM46215
NameBDBM46215
Synonyms:2-[4-[[5-(4-chlorophenyl)-6-isopropoxycarbonyl-3-keto-7-methyl-5H-thiazolo[3,2-a]pyrimidin-2-ylidene]methyl]phenoxy]acetic acid 2-[4-[[5-(4-chlorophenyl)-7-methyl-3-oxo-6-[oxo(propan-2-yloxy)methyl]-5H-thiazolo[3,2-a]pyrimidin-2-ylidene]methyl]phenoxy]acetic acid MLS-0351065.0001 | cid_3266419
TypeSmall organic molecule
Emp. Form.C26H23ClN2O6S
Mol. Mass.526.989
SMILESCC(C)OC(=O)C1=C(C)N=c2sc(=Cc3ccc(OCC(O)=O)cc3)c(=O)n2C1c1ccc(Cl)cc1