Reaction Details
TargetTyrosine-protein phosphatase non-receptor type 22
LigandBDBM46274
Substrate/Competitorn/a
Meas. Tech.SAR LYP1 Fluorescent Assay using OMFP substrate for In Vitro dose response studies - Set 3
IC50 3950±n/a nM
Citation PubChem, PC SAR LYP1 Fluorescent Assay using OMFP substrate for In Vitro dose response studies - Set 3 PubChem Bioassay(2010)[AID]
 
Tyrosine-protein phosphatase non-receptor type 22
Name:Tyrosine-protein phosphatase non-receptor type 22
Type:n/a
Mol. Mass.:91712.31
Organism:Homo sapiens (Human)
Description:Q9Y2R2
Residue:807
BDBM46274
NameBDBM46274
Synonyms:2-[2,6-bis(chloranyl)-4-[(Z)-[3-[2-[(4-methylphenyl)amino]-2-oxidanylidene-ethyl]-2,4-bis(oxidanylidene)-1,3-thiazolidin-5-ylidene]methyl]phenoxy]ethanoic acid 2-[2,6-dichloro-4-[(Z)-[3-[2-(4-methylanilino)-2-oxoethyl]-2,4-dioxo-1,3-thiazolidin-5-ylidene]methyl]phenoxy]acetic acid MLS-0349987.0001 | cid_1796598
TypeSmall organic molecule
Emp. Form.C21H16Cl2N2O6S
Mol. Mass.495.333
SMILESCc1ccc(NC(=O)CN2C(=O)S\C(=C/c3cc(Cl)c(OCC(O)=O)c(Cl)c3)C2=O)cc1