Reaction Details
TargetTyrosine-protein phosphatase non-receptor type 22
LigandBDBM61646
Substrate/Competitorn/a
Meas. Tech.SAR LYP1 Fluorescent Assay using OMFP substrate for In Vitro dose response studies - Set 3
IC50 72200±n/a nM
Citation PubChem, PC SAR LYP1 Fluorescent Assay using OMFP substrate for In Vitro dose response studies - Set 3 PubChem Bioassay(2010)[AID]
 
Tyrosine-protein phosphatase non-receptor type 22
Name:Tyrosine-protein phosphatase non-receptor type 22
Type:n/a
Mol. Mass.:91712.31
Organism:Homo sapiens (Human)
Description:Q9Y2R2
Residue:807
BDBM61646
NameBDBM61646
Synonyms:4-[4-(5-Benzylidene-4-oxo-2-thioxo-thiazolidin-3-yl)-butyrylamino]-benzoic acid 4-[4-[(5E)-5-benzal-4-keto-2-thioxo-thiazolidin-3-yl]butanoylamino]benzoic acid 4-[[1-oxo-4-[(5E)-4-oxo-5-(phenylmethylene)-2-sulfanylidene-3-thiazolidinyl]butyl]amino]benzoic acid SMR000608142 | cid_1416931
TypeSmall organic molecule
Emp. Form.C21H18N2O4S2
Mol. Mass.426.509
SMILESOC(=O)c1ccc(NC(=O)CCCN2C(=S)S\C(=C\c3ccccc3)C2=O)cc1