Reaction Details
TargetTyrosine-protein phosphatase non-receptor type 22
LigandBDBM58651
Substrate/Competitorn/a
Meas. Tech.SAR LYP1 Fluorescent Assay using OMFP substrate for In Vitro dose response studies - Set 3
IC50 76800±n/a nM
Citation PubChem, PC SAR LYP1 Fluorescent Assay using OMFP substrate for In Vitro dose response studies - Set 3 PubChem Bioassay(2010)[AID]
 
Tyrosine-protein phosphatase non-receptor type 22
Name:Tyrosine-protein phosphatase non-receptor type 22
Type:n/a
Mol. Mass.:91712.31
Organism:Homo sapiens (Human)
Description:Q9Y2R2
Residue:807
BDBM58651
NameBDBM58651
Synonyms:4-[4-[(5Z)-5-(4-ethylbenzylidene)-4-keto-2-thioxo-thiazolidin-3-yl]butanoylamino]benzoic acid 4-[4-[(5Z)-5-[(4-ethylphenyl)methylidene]-4-oxo-2-sulfanylidene-1,3-thiazolidin-3-yl]butanoylamino]benzoic acid MLS001075748 cid_1985027
TypeSmall organic molecule
Emp. Form.C23H22N2O4S2
Mol. Mass.454.562
SMILESCCc1ccc(\C=C2/SC(=S)N(CCCC(=O)Nc3ccc(cc3)C(O)=O)C2=O)cc1