Reaction Details
TargetTyrosine-protein phosphatase non-receptor type 22
LigandBDBM46270
Substrate/Competitorn/a
Meas. Tech.SAR LYP1 Fluorescent Assay using pCAP substrate for In Vitro dose response studies - Set 3
IC50 11200±n/a nM
Citation PubChem, PC SAR LYP1 Fluorescent Assay using pCAP substrate for In Vitro dose response studies - Set 3 PubChem Bioassay(2010)[AID]
 
Tyrosine-protein phosphatase non-receptor type 22
Name:Tyrosine-protein phosphatase non-receptor type 22
Type:n/a
Mol. Mass.:91712.31
Organism:Homo sapiens (Human)
Description:Q9Y2R2
Residue:807
BDBM46270
NameBDBM46270
Synonyms:2-[2-chloranyl-4-[(Z)-[2-[(4-ethylphenyl)amino]-4-oxidanylidene-1,3-thiazol-5-ylidene]methyl]phenoxy]ethanoic acid 2-[2-chloro-4-[(Z)-[2-(4-ethylanilino)-4-oxo-1,3-thiazol-5-ylidene]methyl]phenoxy]acetic acid MLS-0425585.0001 | cid_1737079
TypeSmall organic molecule
Emp. Form.C20H17ClN2O4S
Mol. Mass.416.878
SMILESCCc1ccc(NC2=NC(=O)C(S2)=Cc2ccc(OCC(O)=O)c(Cl)c2)cc1