Reaction Details
TargetTyrosine-protein phosphatase non-receptor type 22
LigandBDBM50185
Substrate/Competitorn/a
Meas. Tech.SAR LYP1 Fluorescent Assay using pCAP substrate for In Vitro dose response studies - Set 3
IC50 40900±n/a nM
Citation PubChem, PC SAR LYP1 Fluorescent Assay using pCAP substrate for In Vitro dose response studies - Set 3 PubChem Bioassay(2010)[AID]
 
Tyrosine-protein phosphatase non-receptor type 22
Name:Tyrosine-protein phosphatase non-receptor type 22
Type:n/a
Mol. Mass.:91712.31
Organism:Homo sapiens (Human)
Description:Q9Y2R2
Residue:807
BDBM50185
NameBDBM50185
Synonyms:2-hydroxy-4-({4-[5-(2-methyl-3-phenyl-2-propen-1-ylidene)-4-oxo-2-thioxo-1,3-thiazolidin-3-yl]butanoyl}amino)benzoic acid 2-hydroxy-4-[4-[(5Z)-5-[(E)-2-methyl-3-phenylprop-2-enylidene]-4-oxo-2-sulfanylidene-1,3-thiazolidin-3-yl]butanoylamino]benzoic acid 4-[4-[(5Z)-5-[(E)-2-methyl-3-phenyl-prop-2-enylidene]-4-oxidanylidene-2-sulfanylidene-1,3-thiazolidin-3-yl]butanoylamino]-2-oxidanyl-benzoic acid MLS000575039 cid_2286812
TypeSmall organic molecule
Emp. Form.C24H22N2O5S2
Mol. Mass.482.572
SMILESC\C(\C=C1/SC(=S)N(CCCC(=O)Nc2ccc(C(O)=O)c(O)c2)C1=O)=C/c1ccccc1