Reaction Details
TargetTyrosine-protein phosphatase non-receptor type 22
LigandBDBM61178
Substrate/Competitorn/a
Meas. Tech.SAR LYP1 Fluorescent Assay using pCAP substrate for In Vitro dose response studies - Set 3
IC50 25700±n/a nM
Citation PubChem, PC SAR LYP1 Fluorescent Assay using pCAP substrate for In Vitro dose response studies - Set 3 PubChem Bioassay(2010)[AID]
 
Tyrosine-protein phosphatase non-receptor type 22
Name:Tyrosine-protein phosphatase non-receptor type 22
Type:n/a
Mol. Mass.:91712.31
Organism:Homo sapiens (Human)
Description:Q9Y2R2
Residue:807
BDBM61178
NameBDBM61178
Synonyms:2-[4-[[6-carbethoxy-5-(4-isopropoxyphenyl)-3-keto-7-methyl-5H-thiazolo[3,2-a]pyrimidin-2-ylidene]methyl]phenoxy]acetic acid 2-[4-[[6-ethoxycarbonyl-7-methyl-3-oxo-5-(4-propan-2-yloxyphenyl)-5H-[1,3]thiazolo[3,2-a]pyrimidin-2-ylidene]methyl]phenoxy]acetic acid MLS000704846 cid_4440333 | {4-[(6-(ethoxycarbonyl)-5-(4-isopropoxyphenyl)-7-methyl-3-oxo-5H-[1,3]thiazolo[3,2-a]pyrimidin-2(3H)-ylidene)methyl]phenoxy}acetic acid
TypeSmall organic molecule
Emp. Form.C28H28N2O7S
Mol. Mass.536.596
SMILESCCOC(=O)C1=C(C)N=c2sc(=Cc3ccc(OCC(O)=O)cc3)c(=O)n2C1c1ccc(OC(C)C)cc1