Reaction Details
TargetTyrosine-protein phosphatase non-receptor type 7
LigandBDBM46240
Substrate/Competitorn/a
Meas. Tech.SAR analysis of compounds that inhibit HePTP - Set 2
IC50 1360±n/a nM
Citation PubChem, PC SAR analysis of compounds that inhibit HePTP - Set 2 PubChem Bioassay(2010)[AID]
 
Tyrosine-protein phosphatase non-receptor type 7
Name:Tyrosine-protein phosphatase non-receptor type 7
Type:Protein
Mol. Mass.:40530.79
Organism:Homo sapiens (Human)
Description:P35236
Residue:360
BDBM46240
NameBDBM46240
Synonyms:4-[(E)-2-[3-bromanyl-4-[(4-fluorophenyl)methoxy]phenyl]-1-cyano-ethenyl]benzoic acid 4-[(E)-2-[3-bromo-4-[(4-fluorophenyl)methoxy]phenyl]-1-cyanoethenyl]benzoic acid cid_2240797
TypeSmall organic molecule
Emp. Form.C23H15BrFNO3
Mol. Mass.452.273
SMILESOC(=O)c1ccc(cc1)C(=C/c1ccc(OCc2ccc(F)cc2)c(Br)c1)\C#N