Reaction Details
TargetTyrosine-protein phosphatase non-receptor type 7
LigandBDBM46269
Substrate/Competitorn/a
Meas. Tech.SAR analysis of compounds that inhibit HePTP - Set 2
IC50 1570±n/a nM
Citation PubChem, PC SAR analysis of compounds that inhibit HePTP - Set 2 PubChem Bioassay(2010)[AID]
 
Tyrosine-protein phosphatase non-receptor type 7
Name:Tyrosine-protein phosphatase non-receptor type 7
Type:Protein
Mol. Mass.:40530.79
Organism:Homo sapiens (Human)
Description:P35236
Residue:360
BDBM46269
NameBDBM46269
Synonyms:2-[4-[(E)-[2-(3-bromoanilino)-4-keto-2-thiazolin-5-ylidene]methyl]-2-methoxy-phenoxy]acetic acid 2-[4-[(E)-[2-(3-bromoanilino)-4-oxo-5-thiazolylidene]methyl]-2-methoxyphenoxy]acetic acid MLS-0425581.0001 | cid_1228895
TypeSmall organic molecule
Emp. Form.C19H15BrN2O5S
Mol. Mass.463.302
SMILESCOc1cc(C=C2SC(Nc3cccc(Br)c3)=NC2=O)ccc1OCC(O)=O