Reaction Details
TargetTyrosine-protein phosphatase non-receptor type 7
LigandBDBM65969
Substrate/Competitorn/a
Meas. Tech.SAR analysis of compounds that inhibit HePTP - Set 2
IC50 465±n/a nM
Citation PubChem, PC SAR analysis of compounds that inhibit HePTP - Set 2 PubChem Bioassay(2010)[AID]
 
Tyrosine-protein phosphatase non-receptor type 7
Name:Tyrosine-protein phosphatase non-receptor type 7
Type:Protein
Mol. Mass.:40530.79
Organism:Homo sapiens (Human)
Description:P35236
Residue:360
BDBM65969
NameBDBM65969
Synonyms:2-(4-anilinophenoxy)acetic acid MLS-0258798.0001 | cid_2396472
TypeSmall organic molecule
Emp. Form.C14H13NO3
Mol. Mass.243.2579
SMILESOC(=O)COc1ccc(Nc2ccccc2)cc1