Reaction Details
TargetTyrosine-protein phosphatase non-receptor type 7
LigandBDBM65973
Substrate/Competitorn/a
Meas. Tech.SAR analysis of compounds that inhibit HePTP - Set 2
IC50 2020±n/a nM
Citation PubChem, PC SAR analysis of compounds that inhibit HePTP - Set 2 PubChem Bioassay(2010)[AID]
 
Tyrosine-protein phosphatase non-receptor type 7
Name:Tyrosine-protein phosphatase non-receptor type 7
Type:Protein
Mol. Mass.:40530.79
Organism:Homo sapiens (Human)
Description:P35236
Residue:360
BDBM65973
NameBDBM65973
Synonyms:3-[[(E)-2-cyano-3-[3-methoxy-4-(4-methylbenzyl)oxy-phenyl]acryloyl]amino]benzoic acid 3-[[(E)-2-cyano-3-[3-methoxy-4-[(4-methylphenyl)methoxy]phenyl]prop-2-enoyl]amino]benzoic acid cid_1516213
TypeSmall organic molecule
Emp. Form.C26H22N2O5
Mol. Mass.442.4633
SMILESCOc1cc(\C=C(/C#N)C(=O)Nc2cccc(c2)C(O)=O)ccc1OCc1ccc(C)cc1