Reaction Details
TargetTyrosine-protein phosphatase non-receptor type 7
LigandBDBM46211
Substrate/Competitorn/a
Meas. Tech.SAR analysis of compounds that inhibit HePTP - Set 2
IC50 100000±n/a nM
Citation PubChem, PC SAR analysis of compounds that inhibit HePTP - Set 2 PubChem Bioassay(2010)[AID]
 
Tyrosine-protein phosphatase non-receptor type 7
Name:Tyrosine-protein phosphatase non-receptor type 7
Type:Protein
Mol. Mass.:40530.79
Organism:Homo sapiens (Human)
Description:P35236
Residue:360
BDBM46211
NameBDBM46211
Synonyms:1-cyclohexyl-3-(4-sulfamoylphenyl)thiourea cid_892446
TypeSmall organic molecule
Emp. Form.C13H19N3O2S2
Mol. Mass.313.439
SMILESNS(=O)(=O)c1ccc(NC(=S)NC2CCCCC2)cc1