Reaction Details
TargetTyrosine-protein phosphatase non-receptor type 7
LigandBDBM34347
Substrate/Competitorn/a
Meas. Tech.SAR analysis of compounds that inhibit HePTP - Set 2
IC50 100000±n/a nM
Citation PubChem, PC SAR analysis of compounds that inhibit HePTP - Set 2 PubChem Bioassay(2010)[AID]
 
Tyrosine-protein phosphatase non-receptor type 7
Name:Tyrosine-protein phosphatase non-receptor type 7
Type:Protein
Mol. Mass.:40530.79
Organism:Homo sapiens (Human)
Description:P35236
Residue:360
BDBM34347
NameBDBM34347
Synonyms:MLS000056753 [4-amino-3-(3-methylphenyl)-2-sulfanylidene-1,3-thiazol-5-yl]-(4-methylpiperazin-1-yl)methanone [4-amino-3-(m-tolyl)-2-thioxo-4-thiazolin-5-yl]-(4-methylpiperazino)methanone cid_3000187
TypeSmall organic molecule
Emp. Form.C16H20N4OS2
Mol. Mass.348.486
SMILESCN1CCN(CC1)C(=O)c1sc(=S)n(c1N)-c1cccc(C)c1