Reaction Details
TargetIntegrin alpha-4
LigandBDBM67922
Substrate/Competitorn/a
Meas. Tech.Dose Response of primary screening hit compounds for Identification of VLA-4 Allosteric Modulators
EC50 730±n/a nM
Citation PubChem, PC Dose Response of primary screening hit compounds for Identification of VLA-4 Allosteric Modulators PubChem Bioassay(2010)[AID]
 
Integrin alpha-4
Name:Integrin alpha-4
Type:Membrane Protein
Mol. Mass.:114897.35
Organism:Homo sapiens (Human)
Description:P13612
Residue:1032
BDBM67922
NameBDBM67922
Synonyms:4-chlorophenyl 3-phenyl-6-(trifluoromethyl)-1,2,4-triazin-5-yl sulfide 5-[(4-chlorophenyl)thio]-3-phenyl-6-(trifluoromethyl)-1,2,4-triazine SMR000180067 | cid_6418635
TypeSmall organic molecule
Emp. Form.C16H9ClF3N3S
Mol. Mass.367.776
SMILESFC(F)(F)c1nnc(nc1Sc1ccc(Cl)cc1)-c1ccccc1