Reaction Details
TargetIntegrin alpha-4
LigandBDBM75439
Substrate/Competitorn/a
Meas. Tech.Dose Response of primary screening hit compounds for Identification of VLA-4 Allosteric Modulators
EC50>30000±n/a nM
Citation PubChem, PC Dose Response of primary screening hit compounds for Identification of VLA-4 Allosteric Modulators PubChem Bioassay(2010)[AID]
 
Integrin alpha-4
Name:Integrin alpha-4
Type:Membrane Protein
Mol. Mass.:114897.35
Organism:Homo sapiens (Human)
Description:P13612
Residue:1032
BDBM75439
NameBDBM75439
Synonyms:MLS002473625 SMR001397792 dimethyl-[2-[4-(2-phenylbenzothiophen-3-yl)phenoxy]ethyl]amine
TypeSmall organic molecule
Emp. Form.C24H23NOS
Mol. Mass.373.511
SMILESCN(C)CCOc1ccc(cc1)-c1c(sc2ccccc12)-c1ccccc1