Reaction Details
TargetIntegrin alpha-4
LigandBDBM75442
Substrate/Competitorn/a
Meas. Tech.Dose Response of primary screening hit compounds for Identification of VLA-4 Allosteric Modulators
EC50 12390±n/a nM
Citation PubChem, PC Dose Response of primary screening hit compounds for Identification of VLA-4 Allosteric Modulators PubChem Bioassay(2010)[AID]
 
Integrin alpha-4
Name:Integrin alpha-4
Type:Membrane Protein
Mol. Mass.:114897.35
Organism:Homo sapiens (Human)
Description:P13612
Residue:1032
BDBM75442
NameBDBM75442
Synonyms:2-[4-[2-(3-methoxyphenyl)-1-benzothiophen-3-yl]phenoxy]-N,N-dimethyl-ethanamine 2-[4-[2-(3-methoxyphenyl)benzothiophen-3-yl]phenoxy]ethyl-dimethyl-amine MLS002473629 cid_44202272
TypeSmall organic molecule
Emp. Form.C25H25NO2S
Mol. Mass.403.537
SMILESCOc1cccc(c1)-c1sc2ccccc2c1-c1ccc(OCCN(C)C)cc1