Reaction Details
TargetAryl hydrocarbon receptor
LigandBDBM75448
Substrate/Competitorn/a
Meas. Tech.Luminescence-based cell-based high throughput dose response assay for activators of the Aryl Hydrocarbon Receptor (AHR)
EC50 2828±n/a nM
Citation PubChem, PC Luminescence-based cell-based high throughput dose response assay for activators of the Aryl Hydrocarbon Receptor (AHR) PubChem Bioassay(2010)[AID]
 
Aryl hydrocarbon receptor
Name:Aryl hydrocarbon receptor
Type:PROTEIN
Mol. Mass.:96143.77
Organism:Homo sapiens (Human)
Description:ChEMBL_1503828
Residue:848
BDBM75448
NameBDBM75448
Synonyms:3-oxidanidyl-8-phenyl-4,5-dihydro-[1,2,5]oxadiazolo[3,4-f]cinnolin-3-ium 3-oxido-8-phenyl-4,5-dihydrofurazano[3,4-f]cinnolin-3-ium SMR000038069 | cid_2737129
TypeSmall organic molecule
Emp. Form.C14H10N4O2
Mol. Mass.266.2548
SMILES[O-]n1[o+]nc-2c1CCc1nnc(cc-21)-c1ccccc1