Reaction Details
TargetAryl hydrocarbon receptor
LigandBDBM38363
Substrate/Competitorn/a
Meas. Tech.Luminescence-based cell-based high throughput dose response assay for activators of the Aryl Hydrocarbon Receptor (AHR)
EC50>3395±n/a nM
Citation PubChem, PC Luminescence-based cell-based high throughput dose response assay for activators of the Aryl Hydrocarbon Receptor (AHR) PubChem Bioassay(2010)[AID]
 
Aryl hydrocarbon receptor
Name:Aryl hydrocarbon receptor
Type:PROTEIN
Mol. Mass.:96143.77
Organism:Homo sapiens (Human)
Description:ChEMBL_1503828
Residue:848
BDBM38363
NameBDBM38363
Synonyms:(6Z)-4-ethyl-3-hydroxy-6-[1-(hydroxyamino)-2-(2-quinolinyl)ethylidene]-1-cyclohexa-2,4-dienone (6Z)-4-ethyl-3-hydroxy-6-[1-(hydroxyamino)-2-quinolin-2-ylethylidene]cyclohexa-2,4-dien-1-one MLS000054212 cid_5742518
TypeSmall organic molecule
Emp. Form.C19H18N2O3
Mol. Mass.322.3578
SMILESCCc1cc(C(Cc2ccc3ccccc3n2)N=O)c(O)cc1O