Reaction Details
TargetAryl hydrocarbon receptor
LigandBDBM75514
Substrate/Competitorn/a
Meas. Tech.Luminescence-based cell-based high throughput dose response assay for activators of the Aryl Hydrocarbon Receptor (AHR)
EC50 68.63±n/a nM
Citation PubChem, PC Luminescence-based cell-based high throughput dose response assay for activators of the Aryl Hydrocarbon Receptor (AHR) PubChem Bioassay(2010)[AID]
 
Aryl hydrocarbon receptor
Name:Aryl hydrocarbon receptor
Type:PROTEIN
Mol. Mass.:96143.77
Organism:Homo sapiens (Human)
Description:ChEMBL_1503828
Residue:848
BDBM75514
NameBDBM75514
Synonyms:2-N,5-N-bis(2-methoxyphenyl)pyridine-2,5-dicarboxamide N,N'-bis(2-methoxyphenyl)-2,5-pyridinedicarboxamide N2,N5-bis(2-methoxyphenyl)pyridine-2,5-dicarboxamide cid_1369664
TypeSmall organic molecule
Emp. Form.C21H19N3O4
Mol. Mass.377.3933
SMILESCOc1ccccc1NC(=O)c1ccc(nc1)C(=O)Nc1ccccc1OC