Reaction Details
TargetAryl hydrocarbon receptor
LigandBDBM75530
Substrate/Competitorn/a
Meas. Tech.Luminescence-based cell-based high throughput dose response assay for activators of the Aryl Hydrocarbon Receptor (AHR)
EC50 22.2±n/a nM
Citation PubChem, PC Luminescence-based cell-based high throughput dose response assay for activators of the Aryl Hydrocarbon Receptor (AHR) PubChem Bioassay(2010)[AID]
 
Aryl hydrocarbon receptor
Name:Aryl hydrocarbon receptor
Type:PROTEIN
Mol. Mass.:96143.77
Organism:Homo sapiens (Human)
Description:ChEMBL_1503828
Residue:848
BDBM75530
NameBDBM75530
Synonyms:MLS001200027 N-(4-chlorophenyl)-4-methyl-2-(methylthio)pyrimidine-5-carboxamide N-(4-chlorophenyl)-4-methyl-2-methylsulfanylpyrimidine-5-carboxamide cid_20899656
TypeSmall organic molecule
Emp. Form.C13H12ClN3OS
Mol. Mass.293.772
SMILESCSc1ncc(C(=O)Nc2ccc(Cl)cc2)c(C)n1