Reaction Details
TargetIntestinal-type alkaline phosphatase
LigandBDBM38924
Substrate/Competitorn/a
Meas. Tech.Dose Response concentration confirmation of uHTS hits from a small molecule activators of human intestinal alkaline phosphatase via a luminescent assay
EC50 16800±n/a nM
Citation PubChem, PC Dose Response concentration confirmation of uHTS hits from a small molecule activators of human intestinal alkaline phosphatase via a luminescent assay PubChem Bioassay(2010)[AID]
 
Intestinal-type alkaline phosphatase
Name:Intestinal-type alkaline phosphatase
Type:PROTEIN
Mol. Mass.:56804.94
Organism:Homo sapiens (Human)
Description:ChEMBL_1278525
Residue:528
BDBM38924
NameBDBM38924
Synonyms:2,6-bis(2-pyridinyl)pyridine 2,6-dipyridin-2-ylpyridine SMR000060049 | cid_70848
TypeSmall organic molecule
Emp. Form.C15H11N3
Mol. Mass.233.2679
SMILESc1ccc(nc1)-c1cccc(n1)-c1ccccn1