Reaction Details
TargetIntestinal-type alkaline phosphatase
LigandBDBM75668
Substrate/Competitorn/a
Meas. Tech.Dose Response concentration confirmation of uHTS hits from a small molecule activators of human intestinal alkaline phosphatase via a luminescent assay
EC50 8190±n/a nM
Citation PubChem, PC Dose Response concentration confirmation of uHTS hits from a small molecule activators of human intestinal alkaline phosphatase via a luminescent assay PubChem Bioassay(2010)[AID]
 
Intestinal-type alkaline phosphatase
Name:Intestinal-type alkaline phosphatase
Type:PROTEIN
Mol. Mass.:56804.94
Organism:Homo sapiens (Human)
Description:ChEMBL_1278525
Residue:528
BDBM75668
NameBDBM75668
Synonyms:1-N',6-N'-bis(2-phenoxyacetyl)hexanedihydrazide N1',N6'-bis(1-oxo-2-phenoxyethyl)hexanedihydrazide N1',N6'-bis(2-phenoxyethanoyl)hexanedihydrazide The compound has not trivial name. | cid_3113773
TypeSmall organic molecule
Emp. Form.C22H26N4O6
Mol. Mass.442.465
SMILESO=C(CCCCC(=O)NNC(=O)COc1ccccc1)NNC(=O)COc1ccccc1