Reaction Details
TargetBeta-secretase 1
LigandBDBM269485
Substrate/Competitorn/a
Meas. Tech.BACE1 Binding Assay
pH4.5±n/a
Temperature298.15±n/a K
Ki 5.70±n/a nM
Commentsextracted
Citation Juhl, KTagmose, LMarigo, M 2-amino-5,5-difluoro-6-(fluoromethyl)-6-phenyl-3,4,5,6-tetrahydropyridines as BACE1 inhibitors US Patent US10058540 Publication Date 8/28/2018
 
Beta-secretase 1
Name:Beta-secretase 1
Type:Protein
Mol. Mass.:55755.10
Organism:Homo sapiens (Human)
Description:P56817
Residue:501
BDBM269485
NameBDBM269485
Synonyms: (S)-N-(3-(6-amino-3,3-difluoro-2-(fluoromethyl)-2,3,4,5-tetrahydropyridin-2-yl)-4-fluorophenyl)-5-chloropicolinamide | US10058540, 1
TypeSmall organic molecule
Emp. Form.C18H15ClF4N4O
Mol. Mass.414.785
SMILESNC1=N[C@](CF)(c2cc(NC(=O)c3ccc(Cl)cn3)ccc2F)C(F)(F)CC1