Reaction Details
TargetIntestinal-type alkaline phosphatase
LigandBDBM75747
Substrate/Competitorn/a
Meas. Tech.Dose Response confirmation of uHTS hits from a small molecule inhibitors of human intestinal alkaline phosphatase via a luminescent assay
IC50 1070±n/a nM
Citation PubChem, PC Dose Response confirmation of uHTS hits from a small molecule inhibitors of human intestinal alkaline phosphatase via a luminescent assay PubChem Bioassay(2010)[AID]
 
Intestinal-type alkaline phosphatase
Name:Intestinal-type alkaline phosphatase
Type:PROTEIN
Mol. Mass.:56804.94
Organism:Homo sapiens (Human)
Description:ChEMBL_1278525
Residue:528
BDBM75747
NameBDBM75747
Synonyms:6-(2-fluorophenyl)-2-[4-(2-hydroxyethyl)-3-methyl-5-oxo-2,5-dihydro-1H-pyrazol-1-yl]-4(3H)-pyrimidinone 6-(2-fluorophenyl)-2-[4-(2-hydroxyethyl)-5-methyl-3-oxidanylidene-1H-pyrazol-2-yl]-1H-pyrimidin-4-one MLS000736231 cid_3740917
TypeSmall organic molecule
Emp. Form.C16H15FN4O3
Mol. Mass.330.3137
SMILESCc1[nH]n(-c2nc(cc(=O)[nH]2)-c2ccccc2F)c(=O)c1CCO