Reaction Details
TargetPhotoreceptor-specific nuclear receptor
LigandBDBM43023
Substrate/Competitorn/a
Meas. Tech.TR-FRET-based biochemical high throughput dose response assay to identify NR2E3 inverse agonists
IC50 167.27±n/a nM
Citation PubChem, PC TR-FRET-based biochemical high throughput dose response assay to identify NR2E3 inverse agonists PubChem Bioassay(2010)[AID]
 
Photoreceptor-specific nuclear receptor
Name:Photoreceptor-specific nuclear receptor
Type:PROTEIN
Mol. Mass.:44699.83
Organism:Homo sapiens (Human)
Description:ChEMBL_401901
Residue:410
BDBM43023
NameBDBM43023
Synonyms:2-[[5-(1-benzofuran-2-yl)-4-methyl-1,2,4-triazol-3-yl]sulfanyl]-N-(3-bromophenyl)acetamide 2-[[5-(2-benzofuranyl)-4-methyl-1,2,4-triazol-3-yl]thio]-N-(3-bromophenyl)acetamide 2-{[5-(1-benzofuran-2-yl)-4-methyl-4H-1,2,4-triazol-3-yl]thio}-N-(3-bromophenyl)acetamide SMR000143743 | cid_1262634
TypeSmall organic molecule
Emp. Form.C19H15BrN4O2S
Mol. Mass.443.317
SMILESCn1c(SCC(=O)Nc2cccc(Br)c2)nnc1-c1cc2ccccc2o1