Reaction Details
TargetPhotoreceptor-specific nuclear receptor
LigandBDBM48816
Substrate/Competitorn/a
Meas. Tech.TR-FRET-based biochemical high throughput dose response assay to identify NR2E3 inverse agonists
IC50 3907±n/a nM
Citation PubChem, PC TR-FRET-based biochemical high throughput dose response assay to identify NR2E3 inverse agonists PubChem Bioassay(2010)[AID]
 
Photoreceptor-specific nuclear receptor
Name:Photoreceptor-specific nuclear receptor
Type:PROTEIN
Mol. Mass.:44699.83
Organism:Homo sapiens (Human)
Description:ChEMBL_401901
Residue:410
BDBM48816
NameBDBM48816
Synonyms:MLS000334839 N-[5-[(4-cyanophenyl)methylsulfanyl]-1,3,4-thiadiazol-2-yl]-1,3-benzothiazole-6-carboxamide SMR000249597 | cid_2452051
TypeSmall organic molecule
Emp. Form.C18H11N5OS3
Mol. Mass.409.508
SMILESO=C(Nc1nnc(SCc2ccc(cc2)C#N)s1)c1ccc2ncsc2c1