Reaction Details
TargetPhotoreceptor-specific nuclear receptor
LigandBDBM54791
Substrate/Competitorn/a
Meas. Tech.TR-FRET-based biochemical high throughput dose response assay to identify NR2E3 inverse agonists
IC50 2861±n/a nM
Citation PubChem, PC TR-FRET-based biochemical high throughput dose response assay to identify NR2E3 inverse agonists PubChem Bioassay(2010)[AID]
 
Photoreceptor-specific nuclear receptor
Name:Photoreceptor-specific nuclear receptor
Type:PROTEIN
Mol. Mass.:44699.83
Organism:Homo sapiens (Human)
Description:ChEMBL_401901
Residue:410
BDBM54791
NameBDBM54791
Synonyms:5-chloranyl-2-methoxy-N-[3-([1,2,4]triazolo[4,3-b]pyridazin-6-yl)phenyl]benzamide MLS000685766 cid_7217786
TypeSmall organic molecule
Emp. Form.C19H14ClN5O2
Mol. Mass.379.8
SMILESCOc1ccc(Cl)cc1C(=O)Nc1cccc(c1)-c1ccc2nncn2n1