Reaction Details
TargetNeuropeptides B/W receptor type 1
LigandBDBM75901
Substrate/Competitorn/a
Meas. Tech.Late-stage fluorescence-based dose response cell-based screening assay to identify antagonists of the G-protein coupled receptor 7 (GPR7): Intracellular calcium release
IC50 281±n/a nM
Citation PubChem, PC Late-stage fluorescence-based dose response cell-based screening assay to identify antagonists of the G-protein coupled receptor 7 (GPR7): Intracellular calcium release PubChem Bioassay(2010)[AID]
 
Neuropeptides B/W receptor type 1
Name:Neuropeptides B/W receptor type 1
Type:Enzyme Catalytic Domain
Mol. Mass.:36111.82
Organism:Homo sapiens (Human)
Description:gi_119607128
Residue:328
BDBM75901
NameBDBM75901
Synonyms:5-chloranyl-2-(3,5-dimethylphenyl)-4-(4-methoxyphenoxy)pyridazin-3-one 5-chloro-2-(3,5-dimethylphenyl)-4-(4-methoxyphenoxy)pyridazin-3-one SR-02000000372 cid_46172919
TypeSmall organic molecule
Emp. Form.C19H17ClN2O3
Mol. Mass.356.803
SMILESCOc1ccc(Oc2c(Cl)cnn(-c3cc(C)cc(C)c3)c2=O)cc1