Reaction Details
TargetIntestinal-type alkaline phosphatase 1
LigandBDBM76166
Substrate/Competitorn/a
Meas. Tech.Dose Response confirmation of uHTS hits from a small molecule inhibitors of mouse intestinal alkaline phosphatase via a luminescent assay
IC50 11000±n/a nM
Citation PubChem, PC Dose Response confirmation of uHTS hits from a small molecule inhibitors of mouse intestinal alkaline phosphatase via a luminescent assay PubChem Bioassay(2010)[AID]
 
Intestinal-type alkaline phosphatase 1
Name:Intestinal-type alkaline phosphatase 1
Type:Enzyme Catalytic Domain
Mol. Mass.:58396.39
Organism:Rattus norvegicus (Rat)
Description:P15693
Residue:540
BDBM76166
NameBDBM76166
Synonyms:1-(m-tolyl)-3-(9-p-anisyl-9-azabicyclo[3.3.1]nonan-3-yl)urea 1-[9-[(4-methoxyphenyl)methyl]-9-azabicyclo[3.3.1]nonan-3-yl]-3-(3-methylphenyl)urea SMR000119351 | cid_3218113
TypeSmall organic molecule
Emp. Form.C24H31N3O2
Mol. Mass.393.5218
SMILES[H]C12CCCC([H])(CC(C1)NC(=O)Nc1cccc(C)c1)N2Cc1ccc(OC)cc1