Reaction Details
TargetIntestinal-type alkaline phosphatase 1
LigandBDBM60796
Substrate/Competitorn/a
Meas. Tech.Dose Response confirmation of uHTS hits from a small molecule inhibitors of mouse intestinal alkaline phosphatase via a luminescent assay
IC50 2840±n/a nM
Citation PubChem, PC Dose Response confirmation of uHTS hits from a small molecule inhibitors of mouse intestinal alkaline phosphatase via a luminescent assay PubChem Bioassay(2010)[AID]
 
Intestinal-type alkaline phosphatase 1
Name:Intestinal-type alkaline phosphatase 1
Type:Enzyme Catalytic Domain
Mol. Mass.:58396.39
Organism:Rattus norvegicus (Rat)
Description:P15693
Residue:540
BDBM60796
NameBDBM60796
Synonyms:1-(4-morpholin-4-ylsulfonylphenyl)-3-[[(Z)-(3-oxidanyl-4-oxidanylidene-cyclohexa-2,5-dien-1-ylidene)methyl]amino]thiourea 1-[[(Z)-(3-hydroxy-4-oxo-1-cyclohexa-2,5-dienylidene)methyl]amino]-3-[4-(4-morpholinylsulfonyl)phenyl]thiourea MLS000759830 cid_6508400
TypeSmall organic molecule
Emp. Form.C18H20N4O5S2
Mol. Mass.436.505
SMILESOc1ccc(C=NNC(=S)Nc2ccc(cc2)S(=O)(=O)N2CCOCC2)cc1O