Reaction Details
TargetIntestinal-type alkaline phosphatase 1
LigandBDBM54140
Substrate/Competitorn/a
Meas. Tech.Dose Response confirmation of uHTS hits from a small molecule inhibitors of mouse intestinal alkaline phosphatase via a luminescent assay
IC50 6460±n/a nM
Citation PubChem, PC Dose Response confirmation of uHTS hits from a small molecule inhibitors of mouse intestinal alkaline phosphatase via a luminescent assay PubChem Bioassay(2010)[AID]
 
Intestinal-type alkaline phosphatase 1
Name:Intestinal-type alkaline phosphatase 1
Type:Enzyme Catalytic Domain
Mol. Mass.:58396.39
Organism:Rattus norvegicus (Rat)
Description:P15693
Residue:540
BDBM54140
NameBDBM54140
Synonyms:MLS001043248 N-[(5Z)-4-oxidanylidene-5-(2-oxidanylidene-1H-indol-3-ylidene)-2-sulfanylidene-1,3-thiazolidin-3-yl]benzamide N-[(5Z)-4-oxo-5-(2-oxo-1H-indol-3-ylidene)-2-sulfanylidene-3-thiazolidinyl]benzamide SMR000425314 | cid_5457058
TypeSmall organic molecule
Emp. Form.C18H11N3O3S2
Mol. Mass.381.428
SMILESO=C(NN1C(=S)S\C(C1=O)=C1/C(=O)Nc2ccccc12)c1ccccc1