Reaction Details
TargetIntestinal-type alkaline phosphatase 1
LigandBDBM76205
Substrate/Competitorn/a
Meas. Tech.Dose Response confirmation of uHTS hits from a small molecule inhibitors of mouse intestinal alkaline phosphatase via a luminescent assay
IC50 2300±n/a nM
Citation PubChem, PC Dose Response confirmation of uHTS hits from a small molecule inhibitors of mouse intestinal alkaline phosphatase via a luminescent assay PubChem Bioassay(2010)[AID]
 
Intestinal-type alkaline phosphatase 1
Name:Intestinal-type alkaline phosphatase 1
Type:Enzyme Catalytic Domain
Mol. Mass.:58396.39
Organism:Rattus norvegicus (Rat)
Description:P15693
Residue:540
BDBM76205
NameBDBM76205
Synonyms:4-Fluoro-N-[4-hydroxy-3-(1H-[1,2,4]triazol-3-ylsulfanyl)-phenyl]-2-methyl-benzenesulfonamide 4-fluoro-N-[4-hydroxy-3-(1H-1,2,4-triazol-5-ylsulfanyl)phenyl]-2-methylbenzenesulfonamide 4-fluoro-N-[4-hydroxy-3-(1H-1,2,4-triazol-5-ylthio)phenyl]-2-methylbenzenesulfonamide SMR000612865 | cid_1094879
TypeSmall organic molecule
Emp. Form.C15H13FN4O3S2
Mol. Mass.380.417
SMILESCc1cc(F)ccc1S(=O)(=O)Nc1ccc(O)c(Sc2nnc[nH]2)c1