Reaction Details
TargetIntestinal-type alkaline phosphatase 1
LigandBDBM4293
Substrate/Competitorn/a
Meas. Tech.Dose Response confirmation of uHTS hits from a small molecule inhibitors of mouse intestinal alkaline phosphatase via a luminescent assay
IC50 7130±n/a nM
Citation PubChem, PC Dose Response confirmation of uHTS hits from a small molecule inhibitors of mouse intestinal alkaline phosphatase via a luminescent assay PubChem Bioassay(2010)[AID]
 
Intestinal-type alkaline phosphatase 1
Name:Intestinal-type alkaline phosphatase 1
Type:Enzyme Catalytic Domain
Mol. Mass.:58396.39
Organism:Rattus norvegicus (Rat)
Description:P15693
Residue:540
BDBM4293
NameBDBM4293
Synonyms:(2E)-3-(3,4-dihydroxyphenyl)-2-[(3,4-dihydroxyphenyl)carbonyl]prop-2-enenitrile Tyrphostin deriv. 24 | cid_5328760
TypeSmall organic molecule
Emp. Form.C16H11NO5
Mol. Mass.297.2622
SMILESOc1ccc(\C=C(/C#N)C(=O)c2ccc(O)c(O)c2)cc1O