Reaction Details
TargetIntegrin alpha-4
LigandBDBM76256
Substrate/Competitorn/a
Meas. Tech.SAR Confirmatory Dose Response LIBS Assay for Allosteric Ligands of the VLA-4 Integrin
EC50 23280±n/a nM
Citation PubChem, PC SAR Confirmatory Dose Response LIBS Assay for Allosteric Ligands of the VLA-4 Integrin PubChem Bioassay(2010)[AID]
 
Integrin alpha-4
Name:Integrin alpha-4
Type:Membrane Protein
Mol. Mass.:114897.35
Organism:Homo sapiens (Human)
Description:P13612
Residue:1032
BDBM76256
NameBDBM76256
Synonyms:5-[2,5-bis(oxidanylidene)pyrrolidin-1-yl]-N-(3-chloranyl-4-methyl-phenyl)-2-morpholin-4-yl-benzamide N-(3-chloro-4-methylphenyl)-5-(2,5-dioxo-1-pyrrolidinyl)-2-(4-morpholinyl)benzamide VU0419498-1 | cid_26833095
TypeSmall organic molecule
Emp. Form.C22H22ClN3O4
Mol. Mass.427.881
SMILESCc1ccc(NC(=O)c2cc(ccc2N2CCOCC2)-n2c(O)ccc2O)cc1Cl