Reaction Details
TargetIntestinal-type alkaline phosphatase
LigandBDBM67333
Substrate/Competitorn/a
Meas. Tech.Dose Response confirmation of uHTS hits from a small molecule inhibitors of human intestinal alkaline phosphatase via a luminescent assay - Set 2
IC50 34000±n/a nM
Citation PubChem, PC Dose Response confirmation of uHTS hits from a small molecule inhibitors of human intestinal alkaline phosphatase via a luminescent assay - Set 2 PubChem Bioassay(2010)[AID]
 
Intestinal-type alkaline phosphatase
Name:Intestinal-type alkaline phosphatase
Type:PROTEIN
Mol. Mass.:56804.94
Organism:Homo sapiens (Human)
Description:ChEMBL_1278525
Residue:528
BDBM67333
NameBDBM67333
Synonyms:8-(dimethylamino)-10-(2,3,4,5-tetrahydroxypentyl)benzo[g]pteridine-2,4-dione 8-(dimethylamino)-10-[2,3,4,5-tetrakis(oxidanyl)pentyl]benzo[g]pteridine-2,4-dione MLS001213081 cid_3138587
TypeSmall organic molecule
Emp. Form.C17H21N5O6
Mol. Mass.391.3785
SMILESCN(C)c1ccc2nc3c(nc(=O)[nH]c3=O)n(CC(O)C(O)C(O)CO)c2c1