Reaction Details
TargetCitrate synthase, peroxisomal [1-24]
LigandBDBM382
Substrate/Competitorn/a
Meas. Tech.Confirmatory Cherry Pick 3 SAR Dose Response Multiplex in TOR pathway GFP-fusion proteins for Saccharomyes cerevisiae, specifically CIT2
EC50 299500±n/a nM
Citation PubChem, PC Confirmatory Cherry Pick 3 SAR Dose Response Multiplex in TOR pathway GFP-fusion proteins for Saccharomyes cerevisiae, specifically CIT2 PubChem Bioassay(2011)[AID]
 
Citrate synthase, peroxisomal [1-24]
Name:Citrate synthase, peroxisomal [1-24]
Type:Enzyme Catalytic Domain
Mol. Mass.:2731.97
Organism:Saccharomyces cerevisiae
Description:gi_171229
Residue:24
BDBM382
NameBDBM382
Synonyms:1571-30-8 8-hydroxy-2-quinolinecarboxylic acid 8-hydroxyquinoline-2-carboxylic acid BDBM237136 MLS000849721 Quinaldic acid, 8-hydroxy- cid_74079
TypeSmall organic molecule
Emp. Form.C10H7NO3
Mol. Mass.189.1675
SMILESOC(=O)c1ccc2cccc(O)c2n1