Reaction Details
TargetMu-type opioid receptor
LigandBDBM71567
Substrate/Competitorn/a
Meas. Tech.SAR Analysis of Antagonists of the MOR Receptor using an Image-Based Assay - Set 3
IC50 10300±n/a nM
Citation PubChem, PC SAR Analysis of Antagonists of the MOR Receptor using an Image-Based Assay - Set 3 PubChem Bioassay(2010)[AID]
 
Mu-type opioid receptor
Name:Mu-type opioid receptor
Type:G Protein-Coupled Receptor (GPCR)
Mol. Mass.:44789.51
Organism:Homo sapiens (Human)
Description:P35372
Residue:400
BDBM71567
NameBDBM71567
Synonyms:KSC-11-23-1 N-[2-[benzyl(ethyl)amino]ethyl]-4-[(tosylamino)methyl]benzamide N-[2-[ethyl-(phenylmethyl)amino]ethyl]-4-[[(4-methylphenyl)sulfonylamino]methyl]benzamide | cid_44608034
TypeSmall organic molecule
Emp. Form.C26H31N3O3S
Mol. Mass.465.608
SMILESCCN(CCNC(=O)c1ccc(CNS(=O)(=O)c2ccc(C)cc2)cc1)Cc1ccccc1