Reaction Details
TargetCaspase-1
LigandBDBM61402
Substrate/Competitorn/a
Meas. Tech.Dose Response confirmation of inhibitors of NALP1 in yeast using a Caspase-1-ASC counter screen.
IC50 15900±n/a nM
Citation PubChem, PC Dose Response confirmation of inhibitors of NALP1 in yeast using a Caspase-1-ASC counter screen. PubChem Bioassay(2010)[AID]
 
Caspase-1
Name:Caspase-1
Type:Enzyme
Mol. Mass.:45154.13
Organism:Homo sapiens (Human)
Description:P29466
Residue:404
BDBM61402
NameBDBM61402
Synonyms:(Z)-2-butenedioic acid;2-(2,2-dicyclohexylethyl)piperidine 2-(2,2-dicyclohexylethyl)piperidine;maleic acid CHEMBL75880 Perhexiline cid_5284439 | perhexiline maleate
TypeSmall organic molecule
Emp. Form.C19H35N
Mol. Mass.277.4879
SMILESC(C(C1CCCCC1)C1CCCCC1)C1CCCCN1