Reaction Details
TargetLysine-specific demethylase 5B
LigandBDBM270517
Substrate/Competitorn/a
Meas. Tech.Jarid1B Assay
IC50<100±n/a nM
Citation Chen, YKWallace, MB Histone demethylase inhibitors US Patent US10059687 Publication Date 8/28/2018
 
Lysine-specific demethylase 5B
Name:Lysine-specific demethylase 5B
Type:Protein
Mol. Mass.:175659.67
Organism:Homo sapiens (Human)
Description:Q9UGL1
Residue:1544
BDBM270517
NameBDBM270517
Synonyms:(S)-3-(((2-methyl-6-(o-tolyl)-1,2,3,4-tetrahydro-isoquinolin-1-yl)methyl)amino)isonicotinic acid US11001568, Example 12B
TypeSmall organic molecule
Emp. Form.C24H25N3O2
Mol. Mass.387.4742
SMILESCN1CCc2cc(ccc2[C@H]1CNc1cnccc1C(O)=O)-c1ccccc1C