Reaction Details
TargetIntestinal-type alkaline phosphatase
LigandBDBM57432
Substrate/Competitorn/a
Meas. Tech.Dose Response confirmation of uHTS inhibitors of Mouse Intestinal Alkaline Phosphatase using Human Intestinal Alkaline Phosphatase
IC50 42400±n/a nM
Citation PubChem, PC Dose Response confirmation of uHTS inhibitors of Mouse Intestinal Alkaline Phosphatase using Human Intestinal Alkaline Phosphatase PubChem Bioassay(2010)[AID]
 
Intestinal-type alkaline phosphatase
Name:Intestinal-type alkaline phosphatase
Type:PROTEIN
Mol. Mass.:56804.94
Organism:Homo sapiens (Human)
Description:ChEMBL_1278525
Residue:528
BDBM57432
NameBDBM57432
Synonyms:1-(3-chloranyl-2-methyl-phenyl)-3-(3,3-diphenylpropyl)thiourea 1-(3-chloro-2-methylphenyl)-3-(3,3-diphenylpropyl)thiourea N-(3-chloro-2-methylphenyl)-N'-(3,3-diphenylpropyl)thiourea cid_2171132
TypeSmall organic molecule
Emp. Form.C23H23ClN2S
Mol. Mass.394.96
SMILESCc1c(Cl)cccc1NC(=S)NCCC(c1ccccc1)c1ccccc1