Reaction Details
TargetIntestinal-type alkaline phosphatase
LigandBDBM76184
Substrate/Competitorn/a
Meas. Tech.Dose Response confirmation of uHTS inhibitors of Mouse Intestinal Alkaline Phosphatase using Human Intestinal Alkaline Phosphatase
IC50 23600±n/a nM
Citation PubChem, PC Dose Response confirmation of uHTS inhibitors of Mouse Intestinal Alkaline Phosphatase using Human Intestinal Alkaline Phosphatase PubChem Bioassay(2010)[AID]
 
Intestinal-type alkaline phosphatase
Name:Intestinal-type alkaline phosphatase
Type:PROTEIN
Mol. Mass.:56804.94
Organism:Homo sapiens (Human)
Description:ChEMBL_1278525
Residue:528
BDBM76184
NameBDBM76184
Synonyms:4-[(2,9-dioxo-1,2,4,5,6,7,8,9-octahydropyrazolo[5,1-b]quinazolin-3-yl)diazenyl]benzenesulfonamide 4-[2-[2,9-bis(oxidanylidene)-5,6,7,8-tetrahydro-1H-pyrazolo[5,1-b]quinazolin-3-ylidene]hydrazinyl]benzenesulfonamide MLS000705743 cid_16189729
TypeSmall organic molecule
Emp. Form.C16H16N6O4S
Mol. Mass.388.401
SMILESNS(=O)(=O)c1ccc(cc1)N=Nc1c2[nH]c3CCCCc3c(=O)n2[nH]c1=O