Reaction Details
TargetIntestinal-type alkaline phosphatase
LigandBDBM76186
Substrate/Competitorn/a
Meas. Tech.Dose Response confirmation of uHTS inhibitors of Mouse Intestinal Alkaline Phosphatase using Human Intestinal Alkaline Phosphatase
IC50 7730±n/a nM
Citation PubChem, PC Dose Response confirmation of uHTS inhibitors of Mouse Intestinal Alkaline Phosphatase using Human Intestinal Alkaline Phosphatase PubChem Bioassay(2010)[AID]
 
Intestinal-type alkaline phosphatase
Name:Intestinal-type alkaline phosphatase
Type:PROTEIN
Mol. Mass.:56804.94
Organism:Homo sapiens (Human)
Description:ChEMBL_1278525
Residue:528
BDBM76186
NameBDBM76186
Synonyms:6-ketobenzo[c]chromene-3,8-disulfonamide 6-oxo-6H-benzo[c]chromene-3,8-disulfonamide 6-oxobenzo[c]chromene-3,8-disulfonamide SMR000231864 | cid_1819919
TypeSmall organic molecule
Emp. Form.C13H10N2O6S2
Mol. Mass.354.358
SMILESNS(=O)(=O)c1ccc2c(c1)oc(=O)c1cc(ccc21)S(N)(=O)=O