Reaction Details
TargetIntestinal-type alkaline phosphatase
LigandBDBM50710
Substrate/Competitorn/a
Meas. Tech.Dose Response confirmation of uHTS inhibitors of Mouse Intestinal Alkaline Phosphatase using Human Intestinal Alkaline Phosphatase
IC50 24800±n/a nM
Citation PubChem, PC Dose Response confirmation of uHTS inhibitors of Mouse Intestinal Alkaline Phosphatase using Human Intestinal Alkaline Phosphatase PubChem Bioassay(2010)[AID]
 
Intestinal-type alkaline phosphatase
Name:Intestinal-type alkaline phosphatase
Type:PROTEIN
Mol. Mass.:56804.94
Organism:Homo sapiens (Human)
Description:ChEMBL_1278525
Residue:528
BDBM50710
NameBDBM50710
Synonyms:2-(3,4-dihydroxyphenyl)-7,8-dihydroxy-2,3-dihydrochromen-4-one 2-(3,4-dihydroxyphenyl)-7,8-dihydroxy-chroman-4-one MLS000863589 cid_12309904
TypeSmall organic molecule
Emp. Form.C15H12O6
Mol. Mass.288.2522
SMILESOc1ccc(cc1O)C1CC(=O)c2ccc(O)c(O)c2O1