Reaction Details
TargetIntestinal-type alkaline phosphatase
LigandBDBM76232
Substrate/Competitorn/a
Meas. Tech.Dose Response confirmation of uHTS inhibitors of Mouse Intestinal Alkaline Phosphatase using Human Intestinal Alkaline Phosphatase
IC50 14300±n/a nM
Citation PubChem, PC Dose Response confirmation of uHTS inhibitors of Mouse Intestinal Alkaline Phosphatase using Human Intestinal Alkaline Phosphatase PubChem Bioassay(2010)[AID]
 
Intestinal-type alkaline phosphatase
Name:Intestinal-type alkaline phosphatase
Type:PROTEIN
Mol. Mass.:56804.94
Organism:Homo sapiens (Human)
Description:ChEMBL_1278525
Residue:528
BDBM76232
NameBDBM76232
Synonyms:KI-SM SMR001231145 | cid_24978594
TypeSmall organic molecule
Emp. Form.C64H111N17O8S
Mol. Mass.1278.74
SMILESCC[C@H](C)[C@@H](C(=O)NCCCCCCCCCCC(=O)N1CCN(CC1)c1nc(NCCOCCOCCOCC#C)nc(n1)N1CCN(CC1)C(=O)CCCCCCCCCCNC(=O)[C@@H](CCSC)n1cc(CCO)nn1)n1cc(CCCCCN)nn1