Reaction Details
TargetIntestinal-type alkaline phosphatase
LigandBDBM76247
Substrate/Competitorn/a
Meas. Tech.Dose Response confirmation of uHTS inhibitors of Mouse Intestinal Alkaline Phosphatase using Human Intestinal Alkaline Phosphatase
IC50 18300±n/a nM
Citation PubChem, PC Dose Response confirmation of uHTS inhibitors of Mouse Intestinal Alkaline Phosphatase using Human Intestinal Alkaline Phosphatase PubChem Bioassay(2010)[AID]
 
Intestinal-type alkaline phosphatase
Name:Intestinal-type alkaline phosphatase
Type:PROTEIN
Mol. Mass.:56804.94
Organism:Homo sapiens (Human)
Description:ChEMBL_1278525
Residue:528
BDBM76247
NameBDBM76247
Synonyms:MLS002472883 [(2R,3S)-2,8-bis(4-hydroxyphenyl)-3,5-bis(oxidanyl)-3,4,8,9-tetrahydro-2H-furo[2,3-h]chromen-9-yl]-[2,4,6-tris(oxidanyl)phenyl]methanone [(2R,3S)-3,5-dihydroxy-2,8-bis(4-hydroxyphenyl)-3,4,8,9-tetrahydro-2H-furo[2,3-h]chromen-9-yl]-(2,4,6-trihydroxyphenyl)methanone dihydrodaphnodorin B
TypeSmall organic molecule
Emp. Form.C30H24O10
Mol. Mass.544.5056
SMILESO[C@H]1Cc2c(O)cc3OC(C(C(=O)c4c(O)cc(O)cc4O)c3c2O[C@@H]1c1ccc(O)cc1)c1ccc(O)cc1