Reaction Details
TargetAlkaline phosphatase, germ cell type
LigandBDBM46229
Substrate/Competitorn/a
Meas. Tech.Dose Response confirmation of uHTS activators of Mouse Intestinal Alkaline Phosphatase using Placental Alkaline Phosphatase
EC50 63900±n/a nM
Citation PubChem, PC Dose Response confirmation of uHTS activators of Mouse Intestinal Alkaline Phosphatase using Placental Alkaline Phosphatase PubChem Bioassay(2010)[AID]
 
Alkaline phosphatase, germ cell type
Name:Alkaline phosphatase, germ cell type
Type:PROTEIN
Mol. Mass.:57374.31
Organism:Homo sapiens (Human)
Description:ChEMBL_29964
Residue:532
BDBM46229
NameBDBM46229
Synonyms:4-chloranyl-N-(3,4-dihydro-2H-thiochromen-4-yl)-3-sulfamoyl-benzamide 4-chloro-N-(3,4-dihydro-2H-1-benzothiopyran-4-yl)-3-sulfamoylbenzamide MLS-0336143.0001 | cid_16330874
TypeSmall organic molecule
Emp. Form.C16H15ClN2O3S2
Mol. Mass.382.885
SMILESNS(=O)(=O)c1cc(ccc1Cl)C(=O)NC1CCSc2ccccc12