Reaction Details
TargetAlkaline phosphatase, germ cell type
LigandBDBM76166
Substrate/Competitorn/a
Meas. Tech.Dose Response confirmation of uHTS inhibitors of Mouse Intestinal Alkaline Phosphatase using Placental Alkaline Phosphatase
IC50 30500±n/a nM
Citation PubChem, PC Dose Response confirmation of uHTS inhibitors of Mouse Intestinal Alkaline Phosphatase using Placental Alkaline Phosphatase PubChem Bioassay(2010)[AID]
 
Alkaline phosphatase, germ cell type
Name:Alkaline phosphatase, germ cell type
Type:PROTEIN
Mol. Mass.:57374.31
Organism:Homo sapiens (Human)
Description:ChEMBL_29964
Residue:532
BDBM76166
NameBDBM76166
Synonyms:1-(m-tolyl)-3-(9-p-anisyl-9-azabicyclo[3.3.1]nonan-3-yl)urea 1-[9-[(4-methoxyphenyl)methyl]-9-azabicyclo[3.3.1]nonan-3-yl]-3-(3-methylphenyl)urea SMR000119351 | cid_3218113
TypeSmall organic molecule
Emp. Form.C24H31N3O2
Mol. Mass.393.5218
SMILES[H]C12CCCC([H])(CC(C1)NC(=O)Nc1cccc(C)c1)N2Cc1ccc(OC)cc1